BDBM50021543 2-[2-(1-Ethoxycarbonyl-3-phenyl-propylamino)-propionyl]-1,2,3,4-tetrahydro-isoquinoline-3-carboxylic acid ethyl ester::CHEMBL412893
SMILES CCOC(=O)C(CCc1ccccc1)NC(C)C(=O)N1Cc2ccccc2CC1C(=O)OCC
InChI Key InChIKey=DRKDCOUMTGAAKG-UHFFFAOYSA-N
Data  1 IC50
  Tab Delimited (TSV)   2D SDfile   Computed 3D by Vconf -m prep SDfile
Find this compound or compounds like it in BindingDB:
Activity Spreadsheet -- Enzyme Inhibition Constant Data from BindingDB
Found 1 hit for monomerid = 50021543
TargetAngiotensin-converting enzyme(Homo sapiens (Human))
TBA
Curated by ChEMBL
LigandPNGBDBM50021543(2-[2-(1-Ethoxycarbonyl-3-phenyl-propylamino)-propi...)
Affinity DataIC50:  440nM. Assay description: Inhibition of guinea pig angiotensin I converting enzyme
In DepthDetails ArticlePubMed